{"text_format":"1","workbook":"xlsx","n_sheets":8,"sheets":["Accueil","Ordres en cours","Histo. Fichiers","Histo. Ordres","Modèles","Paramètres","Impression","Table de conversion"],"not_rendered":{"charts":0,"images":7,"macros":1,"external_links":0,"defined_names":7,"comments":0,"pivot_tables":0},"unopened":[],"bounds":{"document_bytes":16777216,"sheet_cells":100000,"rows_first":2000,"rows_last":500,"rows_between":2000,"halvings":0,"cell_chars":16384,"cell_head_chars":4096},"cells_cut":0,"cells_raw":0,"read":"whole","date_system":"1900"}

{"sheet":"Accueil","index":0,"n_rows":19,"n_cols":5,"rows_kept":19,"cut":false,"hidden":false,"merged":[]}
[]
[]
[]
[]
[]
[null,null,null,"Montant total :","0"]
[null,null,null,"Nombre d'ordres : ",0]
[]
[]
[]
[]
[]
[]
[]
[null,null,null,"Date de règlement : ","2025-12-10"]
[]
[null,null,null,"ID Fichier : ","DINDINDI-20251210-02"]
[null,null,null,"Montant total :","0"]
[null,null,null,"Nombre d'ordres : ",0]

{"sheet":"Ordres en cours","index":1,"n_rows":1,"n_cols":11,"rows_kept":1,"cut":false,"hidden":false,"merged":[]}
["Montant","Dev.O","Dev.R","Charge","Etablissement Donneur d'ordre","Client Donneur d'ordre","Bénéficiaire","Banque du bénéficière","IBAN ou BBAN","N° Compte du bénéficiaire","Motif de paiement"]

{"sheet":"Histo. Fichiers","index":2,"n_rows":2,"n_cols":6,"rows_kept":2,"cut":false,"hidden":false,"merged":[]}
["Date / Heure","ID fichier000000","Date règlement","Montant","Nb ordres","Emetteur"]
["10/12/25, 14:21:12","DINDINDI-20251210-01","10/12/25","    2 361 394      ",2,"BDFEFRPPCCT"]

{"sheet":"Histo. Ordres","index":3,"n_rows":3,"n_cols":13,"rows_kept":3,"cut":false,"hidden":false,"merged":[]}
["ID Fichier","Montant","Dev.O","Dev.R","Charge","Etablissement Donneur d'ordre","Client Donneur d'ordre","Bénéficiaire","Banque du bénéficiaire","IBAN ou BBAN","N° Compte du bénéficiaire","Motif de paiement","EndToEnd"]
["DINDINDI-20251210-01","        2 600,00   ","EUR","EUR","Donneur d'ordre","FR6330001005960000T05505491\nDDFIP ALPES MARITIMES\nRUE DELILLE\n15 BIS\n06073\nNICE\nFR","FR7610071060000000100539992\nOBSERVATOIRE DE LA COTE D'AZUR\nBOULEVARD DE L'OBSERVATOIRE CS 34229\n96\n06304\nNICE\nFR","YUJI ITOH\n48-6-303 NAKAJUKU, ITABASHI-KU\n\n173-0005\nTOKYO\n\nJP","SMTCJPJT\n","BBAN","03780024393","DP 2025-003087 BOURSE 2025","VI99-DINDINDI-20251210-01-01-E2E001"]
["DINDINDI-20251210-01","    2 358 794      ","CLP","CLP","Donneur d'ordre","FR6330001005960000T05505491\nDDFIP ALPES MARITIMES\nRUE DELILLE\n15 BIS\n06073\nNICE\nFR","FR7610071060000000100539992\nOBSERVATOIRE DE LA COTE D'AZUR\nBOULEVARD DE L'OBSERVATOIRE CS 34229\n96\n06304\nNICE\nFR","GTD TELEDUCTOS SA\nMENADO 920 - PISO 11\n\n358000\nSANTIAGO\n\nCL","CREDCLRM\n","BBAN","10277358","DP 2025-3268 INVOICE 001492487 RUT 88.983.600.8","VI99-DINDINDI-20251210-01-01-E2E002"]

{"sheet":"Modèles","index":4,"n_rows":3,"n_cols":12,"rows_kept":3,"cut":false,"hidden":false,"merged":[]}
["Nom modèle d'ordre","Montant","Dev.O","Dev.R","Charge","Etablissement Donneur d'ordre","Client Donneur d'ordre","Bénéficiaire","Banque du bénéficiaire","IBAN ou BBAN","N° Compte du bénéficiaire","Motif de paiement"]
["JAPON YUJI ITOH","","EUR","EUR","Donneur d'ordre","FR6330001005960000T05505491\nDDFIP ALPES MARITIMES\nRUE DELILLE\n15 BIS\n06073\nNICE\nFR","FR7610071060000000100539992\nOBSERVATOIRE DE LA COTE D'AZUR\nBOULEVARD DE L'OBSERVATOIRE CS 34229\n96\n06304\nNICE\nFR","YUJI ITOH\n48-6-303 NAKAJUKU, ITABASHI-KU\n\n173-0005\nTOKYO\n\nJP","SMTCJPJT\n","BBAN","03780024393","DP 2025-003087 BOURSE 2025"]
["CHILI GTD TELEDUCTOS","","CLP","CLP","Donneur d'ordre","FR6330001005960000T05505491\nDDFIP ALPES MARITIMES\nRUE DELILLE\n15 BIS\n06073\nNICE\nFR","FR7610071060000000100539992\nOBSERVATOIRE DE LA COTE D'AZUR\nBOULEVARD DE L'OBSERVATOIRE CS 34229\n96\n06304\nNICE\nFR","GTD TELEDUCTOS SA\nMENADO 920 - PISO 11\n\n\nSANTIAGO\n\nCL","CREDCLRM\n","BBAN","10277358","DP 2025-3268 INVOICE 001492487 RUT 88.983.600.8 "]

{"sheet":"Paramètres","index":5,"n_rows":311,"n_cols":11,"rows_kept":311,"cut":false,"hidden":false,"merged":[]}
["Fichier",null,null,"Code","Nom devise","Nb décimal",null,"Code","Nom pays","Format BBAN","International Bank Account Number - Wikipedia"]
[" ",null,null,"AED","Dirham des Emirats Arabes Unis",2,null,"AD","Andorre","[0-9]{8}[0-9A-Z]{12}"]
["Répertoire de génération :","C:\\Users\\mmolinari\\Desktop\\EVE\\Bordereaux",null,"AFN","Afghani",2,null,"AE","Emirats arabes unis","[0-9]{3}[0-9]{16}"]
["Radical du nom du client DFT : ","DINDINDI",null,"ALL","Lek",2,null,"AF","Afghanistan",""]
["BIC BDF :","BDFEFRPPCCT",null,"AMD","Dram",2,null,"AG","Antigua et Barbuda",""]
[" ",null,null,"ANG","Florin",2,null,"AI","Anguilla",""]
["Etablissement donneur d'ordre par défaut",null,null,"AOA","Kwanza",2,null,"AL","Albanie","[0-9]{8}[0-9A-Z]{16}"]
[null,null,null,"ARS","Peso Argentin",2,null,"AM","Arménie",""]
["IBAN : ","FR4930001007180000D05055052",null,"AUD","Dollar Australien",2,null,"AO","Angola",""]
["Nom : ","DINR",null,"AWG","Arubian Guilder",2,null,"AR","Argentine",""]
["Rue : ","...",null,"AZN","Manat",2,null,"AS","Samoa américaines",""]
["N° Bâtiment :","...",null,"BAM","Mark Convertible",2,null,"AT","Autriche","[0-9]{16}"]
["Code postal :","00000",null,"BBD","Dollar de Barbade",2,null,"AU","Australie",""]
["Ville :  ","...",null,"BDT","Taka",2,null,"AW","Aruba",""]
["Pays : ","FR",null,"BGN","Lev Bulgare",2,null,"AX","Åland, Îles",""]
["Modifiable : ","Oui",null,"BHD","Dinar de Barhein",3,null,"AZ","Azerbaïdjan","[A-Z]{4}[0-9A-Z]{20}"]
[null,null,null,"BIF","Franc du Burundi",0,null,"BA","Bosnie-Herzégovine","[0-9]{16}"]
["Client donneur d'ordre par défaut",null,null,"BMD","Dollar des Bermudes",2,null,"BB","Barbade",""]
[null,null,null,"BND","Dollar de Brunei",2,null,"BD","Bangladesh",""]
["IBAN : ","FR4930001007180000D05055052",null,"BOB","Boliviano",2,null,"BE","Belgique","[0-9]{12}"]
["Nom : ","DINR",null,"BRL","Real",2,null,"BF","Burkina Faso",""]
["Rue : ","...",null,"BSD","Dollar des Bahamas",2,null,"BG","Bulgarie","[A-Z]{4}[0-9]{6}[0-9A-Z]{8}"]
["N° Bâtiment :","...",null,"BWP","Pula",2,null,"BH","Bahrein","[A-Z]{4}[0-9A-Z]{14}"]
["Code postal :","00000",null,"BYN","Nouveau Rouble de Bielorussie",2,null,"BI","Burundi",""]
["Ville : ","...",null,"BYR","Rouble Bielorusse",0,null,"BJ","Bénin",""]
["Pays : ","FR",null,"BZD","Dollar de Belize",2,null,"BL","Saint-Barthélemy",""]
["Modifiable : ","Oui",null,"CAD","Dollar Canadien",2,null,"BM","Bermudes",""]
[null,null,null,"CDF","Franc Congolais",2,null,"BN","Brunéi Darussalam",""]
[null,null,null,"CHF","Franc Suisse",2,null,"BO","Bolivie (État plurinational de)",""]
[null,null,null,"CLP","Peso Chilien",0,null,"BQ","Bonaire, Saint-Eustache et Saba",""]
[null,null,null,"CNY","Yuan Renminbi",2,null,"BR","Brésil","[0-9]{23}[A-Z]{1}[0-9A-Z]{1}"]
[null,null,null,"COP","Peso Colombien",2,null,"BS","Bahamas",""]
[null,null,null,"CRC","Colon",2,null,"BT","Bhoutan",""]
[null,null,null,"CVE","Escudo du Cap Vert",2,null,"BV","Bouvet, Ile","[0-9]{11}"]
[null,null,null,"CYP","Livre Chypriote",2,null,"BW","Botswana",""]
[null,null,null,"CZK","Couronne Tcheque",2,null,"BY","Bélarus","[0-9A-Z]{4}[0-9]{ 4}[0-9A-Z]{ 16}"]
[null,null,null,"DJF","Franc de Djibouti",0,null,"BZ","Bélize",""]
[null,null,null,"DKK","Couronne Danoise",2,null,"CA","Canada",""]
[null,null,null,"DOP","Peso Dominicain",2,null,"CC","Cocos/Keeling (Îles)",""]
[null,null,null,"DZD","Dinar Algerien",2,null,"CD","Congo, République démocratique du",""]
[null,null,null,"EGP","Livre Egyptienne",2,null,"CF","République centrafricaine",""]
[null,null,null,"ERN","Nakfa",2,null,"CG","Congo",""]
[null,null,null,"ETB","Birr",2,null,"CH","Suisse","[0-9]{5}[0-9A-Z]{12}"]
[null,null,null,"EUR","Euro",2,null,"CI","Côte d'Ivoire",""]
[null,null,null,"FIM","Mark Finlandais",0,null,"CK","Cook, Iles",""]
[null,null,null,"FJD","Dollar des Fidji",2,null,"CL","Chili",""]
[null,null,null,"GBP","Livre Sterling",2,null,"CM","Cameroun",""]
[null,null,null,"GEL","Lari",2,null,"CN","Chine",""]
[null,null,null,"GHS","Cedi",2,null,"CO","Colombie",""]
[null,null,null,"GMD","Dalasi",2,null,"CR","Costa Rica","[0-9]{18}"]
[null,null,null,"GNF","Franc Guineen",0,null,"CU","Cuba",""]
[null,null,null,"GTQ","Quetzal",2,null,"CV","Cabo Verde",""]
[null,null,null,"GYD","Dollar Guyanais",2,null,"CW","Curaçao",""]
[null,null,null,"HKD","Dollar de Hong Kong",2,null,"CX","Christmas, île",""]
[null,null,null,"HNL","Lempira",2,null,"CY","Chypre","[0-9]{8}[0-9A-Z]{16}"]
[null,null,null,"HTG","Gourde",2,null,"CZ","Tchèque, République","[0-9]{20}"]
[null,null,null,"HUF","Forint",2,null,"DE","Allemagne","[0-9]{18}"]
[null,null,null,"IDR","Rupiah",2,null,"DJ","Djibouti",""]
[null,null,null,"IEP","Livre Irlandaise",0,null,"DK","Danemark","[0-9]{14}"]
[null,null,null,"ILS","Nouveau Shekel",2,null,"DM","Dominique",""]
[null,null,null,"INR","Roupie Indienne",2,null,"DO","Dominicaine, République","[0-9A-Z]{4}[0-9]{20}"]
[null,null,null,"IQD","Dinar Irakien",3,null,"DZ","Algérie",""]
[null,null,null,"ISK","Couronne Islandaise",0,null,"EC","Equateur",""]
[null,null,null,"JMD","Dollar Jamaicain",2,null,"EE","Estonie","[0-9]{16}"]
[null,null,null,"JOD","Dinar Jordanien",3,null,"EG","Egypte","[0-9]{25}"]
[null,null,null,"JPY","Yen",0,null,"EH","Sahara occidental",""]
[null,null,null,"KES","Shilling Kenyan",2,null,"ER","Erythrée",""]
[null,null,null,"KGS","Som",2,null,"ES","Espagne","[0-9]{20}"]
[null,null,null,"KHR","Riel",2,null,"ET","Ethiopie",""]
[null,null,null,"KMF","Franc  Comores",0,null,"FI","Finlande","[0-9]{14}"]
[null,null,null,"KRW","Won",0,null,"FJ","Fidji",""]
[null,null,null,"KWD","Dinar du Koweit",2,null,"FK","Falkland/Malouines (Îles)",""]
[null,null,null,"KYD","Dollar des Iles Caimanes",2,null,"FM","Micronésie, Etats Fédérés de",""]
[null,null,null,"KZT","Tengue",2,null,"FO","FÉROÉ (Îles)","[0-9]{14}"]
[null,null,null,"LAK","Kip",2,null,"FR","FRANCE","[0-9]{10}[0-9A-Z]{11}[0-9]{2}"]
[null,null,null,"LBP","Livre Libanaise",0,null,"GA","Gabon",""]
[null,null,null,"LKR","Roupie Cingalaise",2,null,"GB","Royaume-Uni","[A-Z]{4}[0-9]{14}"]
[null,null,null,"LRD","Dollar Liberien",2,null,"GD","Grenade",""]
[null,null,null,"LSL","Loti",2,null,"GE","Géorgie","[A-Z]{2}[0-9]{16}"]
[null,null,null,"LTL","Litas",2,null,"GF","Guyane française","[0-9]{10}[0-9A-Z]{11}[0-9]{2}"]
[null,null,null,"LVL","Lats Letton",2,null,"GG","Guernesey","[A-Z]{4}[0-9]{14}"]
[null,null,null,"LYD","Dinar Libyen",3,null,"GH","Ghana",""]
[null,null,null,"MAD","Dirham",2,null,"GI","Gibraltar","[A-Z]{4}[0-9A-Z]{15}"]
[null,null,null,"MGA","Ariary",2,null,"GJ","Gaza et Jericho",""]
[null,null,null,"MMK","Kyat",2,null,"GL","Groenland","[0-9]{14}"]
[null,null,null,"MNT","Tugrik",2,null,"GM","Gambie",""]
[null,null,null,"MOP","Pataca",2,null,"GN","Guinée",""]
[null,null,null,"MRU","Ouguiya",2,null,"GP","Guadeloupe","[0-9]{10}[0-9A-Z]{11}[0-9]{2}"]
[null,null,null,"MUR","Roupie de Maurice",2,null,"GQ","Guinée équatoriale",""]
[null,null,null,"MVR","Rufiyaa",2,null,"GR","Grèce","[0-9]{7}[0-9A-Z]{16}"]
[null,null,null,"MWK","Kwacha",2,null,"GS","Géorgie du sud et les îles Sandwich du sud",""]
[null,null,null,"MXN","Peso Mexicain",2,null,"GT","Guatemala","[0-9A-Z]{4}[0-9A-Z]{20}"]
[null,null,null,"MYR","Ringgit",2,null,"GU","Guam",""]
[null,null,null,"MZN","Metical",2,null,"GW","Guinée-Bissau",""]
[null,null,null,"NAD","Dollar Namibien",2,null,"GY","Guyana",""]
[null,null,null,"NGN","Naira",2,null,"HK","Hong Kong",""]
[null,null,null,"NIO","Cordoba Oro",2,null,"HM","Heard, Ile et MacDonald, îles",""]
[null,null,null,"NOK","Couronne Norvegienne",2,null,"HN","Honduras",""]
[null,null,null,"NPR","Roupie Nepalaise",2,null,"HR","Croatie","[0-9]{17}"]
[null,null,null,"NZD","Dollar Neo Zelandais",2,null,"HT","Haïti",""]
[null,null,null,"OMR","Rial Omani",3,null,"HU","Hongrie","[0-9]{24}"]
[null,null,null,"PEN","Nouveau Sol",2,null,"ID","Indonésie",""]
[null,null,null,"PGK","Kina",2,null,"IE","Irlande","[A-Z]{4}[0-9]{6}[0-9]{8}"]
[null,null,null,"PHP","Peso Philippin",2,null,"IL","Israël","[0-9]{19}"]
[null,null,null,"PKR","Roupie Pakistanaise",2,null,"IM","Île de Man","[A-Z]{4}[0-9]{14}"]
[null,null,null,"PLN","Zloty",2,null,"IN","Inde",""]
[null,null,null,"PYG","Guarani",0,null,"IO","Indien (Territoire britannique de l'océan)",""]
[null,null,null,"QAR","Riyal du Qatar",2,null,"IQ","Iraq","[A-Z]{4}[0-9]{15}"]
[null,null,null,"RON","Leu",2,null,"IR","Iran, République islamique d'",""]
[null,null,null,"RSD","Dinar Serbe",2,null,"IS","Islande","[0-9]{22}"]
[null,null,null,"RUB","Rouble Russe",2,null,"IT","Italie","[A-Z]{1}[0-9]{10}[0-9A-Z]{12}"]
[null,null,null,"RWF","Franc du Rwanda",0,null,"JE","Jersey","[A-Z]{4}[0-9]{14}"]
[null,null,null,"SAR","Riyal",2,null,"JM","Jamaïque",""]
[null,null,null,"SBD","Dollar des Iles Salomon",2,null,"JO","Jordanie","[A-Z]{4}[0-9]{4}[0-9A-Z]{18}"]
[null,null,null,"SCR","Roupie des Seychelles",2,null,"JP","Japon",""]
[null,null,null,"SEK","Couronne Suedoise",2,null,"KE","Kenya",""]
[null,null,null,"SGD","Dollar de Singapour",2,null,"KG","Kirghizistan",""]
[null,null,null,"SLE","Leone",2,null,"KH","Cambodge",""]
[null,null,null,"SRD","Dollar du Surinam",2,null,"KI","Kiribati",""]
[null,null,null,"SSP","Livre Sud-soudanaise",2,null,"KM","Comores",""]
[null,null,null,"STN","Dobra",2,null,"KN","Saint-Kitts-et-Nevis",""]
[null,null,null,"SZL","Lilangeni",2,null,"KP","Corée, République populaire démocratique de",""]
[null,null,null,"THB","Baht",2,null,"KR","Corée, République de",""]
[null,null,null,"TJS","Somoni",2,null,"KW","Koweït","[A-Z]{4}[0-9A-Z]{22}"]
[null,null,null,"TND","Dinar",3,null,"KY","Caïmans, Iles",""]
[null,null,null,"TOP","Pa'anga",2,null,"KZ","Kazakhstan","[0-9]{3}[0-9A-Z]{13}"]
[null,null,null,"TRY","Nouvelle Livre Turque",2,null,"LA","Lao, République démocratique populaire",""]
[null,null,null,"TTD","Dollar de Trinite Et Tobago",2,null,"LB","Liban","[0-9]{4}[0-9A-Z]{20}"]
[null,null,null,"TWD","Nouveau Dollar de Taiwan",0,null,"LC","Sainte-Lucie","[A-Z]{4}[0-9A-Z]{24}"]
[null,null,null,"TZS","Shilling Tanzanien",2,null,"LI","Liechtenstein","[0-9]{5}[0-9A-Z]{12}"]
[null,null,null,"UAH","Hryvnia",2,null,"LK","Sri Lanka",""]
[null,null,null,"UGX","Shilling Ougandais",0,null,"LR","Libéria",""]
[null,null,null,"USD","Dollar des Etats Unis",2,null,"LS","Lesotho",""]
[null,null,null,"UYU","Peso Uruguayen",2,null,"LT","Lituanie","[0-9]{16}"]
[null,null,null,"VND","Dong",0,null,"LU","Luxembourg","[0-9]{3}[0-9A-Z]{13}"]
[null,null,null,"VUV","Vatu",0,null,"LV","Lettonie","[A-Z]{4}[0-9A-Z]{13}"]
[null,null,null,"WST","Tala",2,null,"LY","Libye","[0-9]{21}"]
[null,null,null,"XAF","Franc CFA (BEAC)",0,null,"MA","Maroc",""]
[null,null,null,"XCD","Dollar des Caraibes de L'est",2,null,"MC","Monaco","[0-9]{10}[0-9A-Z]{11}[0-9]{2}"]
[null,null,null,"XDR","Special Drawing Rights",5,null,"MD","Moldova, République de","[0-9A-Z]{2}[0-9A-Z]{18}"]
[null,null,null,"XOF","Franc CFA (BCEAO)",0,null,"ME","Monténégro","[0-9]{18}"]
[null,null,null,"XPF","Franc Pacifique",0,null,"MF","Saint-Martin (partie française)",""]
[null,null,null,"YER","Riyal Yemenite",2,null,"MG","Madagascar",""]
[null,null,null,"ZAR","Rand",2,null,"MH","Marshall, Iles",""]
[null,null,null,"ZMW","Kwacha",2,null,"MK","Macédoine, l'ex-République yougoslave de","[0-9]{3}[0-9A-Z]{10}[0-9]{2}"]
[null,null,null,"ZWL","Dollar du Zimbabwe",2,null,"ML","Mali",""]
[null,null,null,null,null,null,null,"MM","Myanmar",""]
[null,null,null,null,null,null,null,"MN","Mongolie",""]
[null,null,null,null,null,null,null,"MO","Macao",""]
[null,null,null,null,null,null,null,"MP","Mariannes du nord, Iles",""]
[null,null,null,null,null,null,null,"MQ","Martinique","[0-9]{10}[0-9A-Z]{11}[0-9]{2}"]
[null,null,null,null,null,null,null,"MR","Mauritanie","[0-9]{23}"]
[null,null,null,null,null,null,null,"MS","Montserrat",""]
[null,null,null,null,null,null,null,"MT","Malte","[A-Z]{4}[0-9]{5}[0-9A-Z]{18}"]
[null,null,null,null,null,null,null,"MU","Maurice","[A-Z]{4}[0-9]{19}[A-Z]{3}"]
[null,null,null,null,null,null,null,"MV","Maldives",""]
[null,null,null,null,null,null,null,"MW","Malawi",""]
[null,null,null,null,null,null,null,"MX","Mexique",""]
[null,null,null,null,null,null,null,"MY","Malaisie",""]
[null,null,null,null,null,null,null,"MZ","Mozambique",""]
[null,null,null,null,null,null,null,"NA","Namibie",""]
[null,null,null,null,null,null,null,"NC","Nouvelle-Calédonie","[0-9]{10}[0-9A-Z]{11}[0-9]{2}"]
[null,null,null,null,null,null,null,"NE","Niger",""]
[null,null,null,null,null,null,null,"NF","Norfolk, Ile",""]
[null,null,null,null,null,null,null,"NG","Nigéria",""]
[null,null,null,null,null,null,null,"NI","Nicaragua",""]
[null,null,null,null,null,null,null,"NL","Pays-Bas","[A-Z]{4}[0-9]{10}"]
[null,null,null,null,null,null,null,"NO","Norvège","[0-9]{11}"]
[null,null,null,null,null,null,null,"NP","Népal",""]
[null,null,null,null,null,null,null,"NR","Nauru",""]
[null,null,null,null,null,null,null,"NU","Niue",""]
[null,null,null,null,null,null,null,"NZ","Nouvelle-Zélande",""]
[null,null,null,null,null,null,null,"OM","Oman",""]
[null,null,null,null,null,null,null,"PA","Panama",""]
[null,null,null,null,null,null,null,"PE","Pérou",""]
[null,null,null,null,null,null,null,"PF","Polynésie française","[0-9]{10}[0-9A-Z]{11}[0-9]{2}"]
[null,null,null,null,null,null,null,"PG","Papouasie-Nouvelle-Guinée",""]
[null,null,null,null,null,null,null,"PH","Philippines",""]
[null,null,null,null,null,null,null,"PK","Pakistan","[A-Z]{4}[0-9A-Z]{16}"]
[null,null,null,null,null,null,null,"PL","Pologne","[0-9]{24}"]
[null,null,null,null,null,null,null,"PM","Saint-Pierre-et-Miquelon","[0-9]{10}[0-9A-Z]{11}[0-9]{2}"]
[null,null,null,null,null,null,null,"PN","Pitcairn",""]
[null,null,null,null,null,null,null,"PR","Porto Rico",""]
[null,null,null,null,null,null,null,"PS","Palestine, Etat de","[A-Z]{4}[0-9A-Z]{21}"]
[null,null,null,null,null,null,null,"PT","Portugal","[0-9]{21}"]
[null,null,null,null,null,null,null,"PW","Palaos",""]
[null,null,null,null,null,null,null,"PY","Paraguay",""]
[null,null,null,null,null,null,null,"QA","Qatar","[A-Z]{4}[0-9A-Z]{21}"]
[null,null,null,null,null,null,null,"RE","Réunion","[0-9]{10}[0-9A-Z]{11}[0-9]{2}"]
[null,null,null,null,null,null,null,"RO","Roumanie","[A-Z]{4}[0-9A-Z]{16}"]
[null,null,null,null,null,null,null,"RS","Serbie","[0-9]{18}"]
[null,null,null,null,null,null,null,"RU","Russie, Fédération de","[0-9]{14}[0-9A-Z]{15}"]
[null,null,null,null,null,null,null,"RW","Rwanda",""]
[null,null,null,null,null,null,null,"SA","Arabie Saoudite","[0-9]{2}[0-9A-Z]{18}"]
[null,null,null,null,null,null,null,"SB","Salomon, Iles",""]
[null,null,null,null,null,null,null,"SC","Seychelles","[A-Z]{4}[0-9]{20}[A-Z]{3}"]
[null,null,null,null,null,null,null,"SD","Soudan","[0-9]{14}"]
[null,null,null,null,null,null,null,"SE","Suède","[0-9]{20}"]
[null,null,null,null,null,null,null,"SG","Singapour",""]
[null,null,null,null,null,null,null,"SH","Sainte-Hélène, Ascension et Tristan da Cunha",""]
[null,null,null,null,null,null,null,"SI","Slovénie","[0-9]{15}"]
[null,null,null,null,null,null,null,"SJ","Svalbard et île Jan Mayen","[0-9]{11}"]
[null,null,null,null,null,null,null,"SK","Slovaquie","[0-9]{20}"]
[null,null,null,null,null,null,null,"SL","Sierra Leone",""]
[null,null,null,null,null,null,null,"SM","Saint-Marin","[A-Z]{1}[0-9]{10}[0-9A-Z]{12}"]
[null,null,null,null,null,null,null,"SN","Sénégal",""]
[null,null,null,null,null,null,null,"SO","Somalie",""]
[null,null,null,null,null,null,null,"SR","Suriname",""]
[null,null,null,null,null,null,null,"SS","Soudan du Sud",""]
[null,null,null,null,null,null,null,"ST","Sao Tomé-et-Principe","[0-9]{21}"]
[null,null,null,null,null,null,null,"SV","El Salvador","[A-Z]{4}[0-9]{ 20}"]
[null,null,null,null,null,null,null,"SX","Saint-Martin (partie néerlandaise)",""]
[null,null,null,null,null,null,null,"SY","République arabe syrienne",""]
[null,null,null,null,null,null,null,"SZ","Swaziland",""]
[null,null,null,null,null,null,null,"TC","Turks-et-Caïcos (Îles)",""]
[null,null,null,null,null,null,null,"TD","Tchad",""]
[null,null,null,null,null,null,null,"TF","Terres australes françaises","[0-9]{10}[0-9A-Z]{11}[0-9]{2}"]
[null,null,null,null,null,null,null,"TG","Togo",""]
[null,null,null,null,null,null,null,"TH","Thaïlande",""]
[null,null,null,null,null,null,null,"TJ","Tadjikistan",""]
[null,null,null,null,null,null,null,"TK","Tokelau",""]
[null,null,null,null,null,null,null,"TL","Timor-Leste",""]
[null,null,null,null,null,null,null,"TM","Turkménistan",""]
[null,null,null,null,null,null,null,"TN","Tunisie","[0-9]{20}"]
[null,null,null,null,null,null,null,"TO","Tonga",""]
[null,null,null,null,null,null,null,"TP","Timor Oriental","[0-9]{19}"]
[null,null,null,null,null,null,null,"TR","Turquie","[0-9]{5}[0-9]{1}[0-9A-Z]{16}"]
[null,null,null,null,null,null,null,"TT","Trinité-et-Tobago",""]
[null,null,null,null,null,null,null,"TV","Tuvalu",""]
[null,null,null,null,null,null,null,"TW","Taïwan, Province de Chine",""]
[null,null,null,null,null,null,null,"TZ","Tanzanie, République unie de",""]
[null,null,null,null,null,null,null,"UA","Ukraine","[0-9]{6}[0-9A-Z]{ 19}"]
[null,null,null,null,null,null,null,"UG","Ouganda",""]
[null,null,null,null,null,null,null,"UM","Îles mineures éloignées des Etats-Unis",""]
[null,null,null,null,null,null,null,"US","Etats-Unis d'Amérique",""]
[null,null,null,null,null,null,null,"UY","Uruguay",""]
[null,null,null,null,null,null,null,"UZ","Ouzbékistan",""]
[null,null,null,null,null,null,null,"VA","Saint-Siège","[0-9]{3}[0-9]{15}"]
[null,null,null,null,null,null,null,"VC","Saint-Vincent-et-les-Grenadines",""]
[null,null,null,null,null,null,null,"VE","Venezuela (République bolivarienne du)",""]
[null,null,null,null,null,null,null,"VG","Îles vierges britanniques","[A-Z]{4}[0-9]{16}"]
[null,null,null,null,null,null,null,"VI","Îles vierges des Etats-Unis",""]
[null,null,null,null,null,null,null,"VN","Viet Nam",""]
[null,null,null,null,null,null,null,"VU","Vanuatu",""]
[null,null,null,null,null,null,null,"WF","Wallis et Futuna",""]
[null,null,null,null,null,null,null,"WS","Samoa",""]
[null,null,null,null,null,null,null,"X2","Pays indeterminés de l'UEM",""]
[null,null,null,null,null,null,null,"XK","République du Kosovo","[0-9]{4}[0-9]{10}[0-9]{2}"]
[null,null,null,null,null,null,null,"XZ","Zone Franc (états africains)",""]
[null,null,null,null,null,null,null,"YE","Yémen",""]
[null,null,null,null,null,null,null,"YT","Mayotte","[0-9]{10}[0-9A-Z]{11}[0-9]{2}"]
[null,null,null,null,null,null,null,"YU","Yougoslavie",""]
[null,null,null,null,null,null,null,"ZA","Afrique du Sud",""]
[null,null,null,null,null,null,null,"ZM","Zambie",""]
[null,null,null,null,null,null,null,"ZW","Zimbabwe",""]
[null,null,null,null,null,null,null,"ZZ","Pays fictif à utiliser pour liaison avec les devises non présentes dans ATENA",""]
[null,null,null,null,null,null,null,"1B","ONU",""]
[null,null,null,null,null,null,null,"1C","FMI",""]
[null,null,null,null,null,null,null,"1E","BIRD",""]
[null,null,null,null,null,null,null,"1F","Association internationale de développement",""]
[null,null,null,null,null,null,null,"1G","Autres organismes lies aux Nations Unies",""]
[null,null,null,null,null,null,null,"1H","UNESCO",""]
[null,null,null,null,null,null,null,"1L","FIDA",""]
[null,null,null,null,null,null,null,"1M","SFI",""]
[null,null,null,null,null,null,null,"1N","Agence multilatérale de garantie des invest.",""]
[null,null,null,null,null,null,null,"1O","UNICEF",""]
[null,null,null,null,null,null,null,"4C","BEI",""]
[null,null,null,null,null,null,null,"4D","Commission européenne",""]
[null,null,null,null,null,null,null,"4E","FED",""]
[null,null,null,null,null,null,null,"4F","BCE",""]
[null,null,null,null,null,null,null,"4G","Fonds européens d’investissement",""]
[null,null,null,null,null,null,null,"4H","CECA",""]
[null,null,null,null,null,null,null,"4K","Parlement européen",""]
[null,null,null,null,null,null,null,"4L","Conseil européen",""]
[null,null,null,null,null,null,null,"4P","Comité économique et social européen",""]
[null,null,null,null,null,null,null,"4Q","Comité européen des régions",""]
[null,null,null,null,null,null,null,"4Z","Autres institutions communautaires européennes",""]
[null,null,null,null,null,null,null,"5A","OCDE",""]
[null,null,null,null,null,null,null,"5B","BRI",""]
[null,null,null,null,null,null,null,"5C","Banque inter-américaine de développement",""]
[null,null,null,null,null,null,null,"5D","Banque africaine de développement (Abidjan)",""]
[null,null,null,null,null,null,null,"5E","Banque asiatique de développement (Manille)",""]
[null,null,null,null,null,null,null,"5F","BERD",""]
[null,null,null,null,null,null,null,"5H","Banque nordique d’investissement",""]
[null,null,null,null,null,null,null,"5I","Banque centrale des Caraïbes de l’est",""]
[null,null,null,null,null,null,null,"5L","Banque de développement des Caraïbes",""]
[null,null,null,null,null,null,null,"5M","Fonds monétaire arabe",""]
[null,null,null,null,null,null,null,"5N","Banque arabe pour le dév. éco. en Afrique",""]
[null,null,null,null,null,null,null,"5O","BCEAO",""]
[null,null,null,null,null,null,null,"5P","BDEAC",""]
[null,null,null,null,null,null,null,"5Q","Fonds africain de développement (Abidjan)",""]
[null,null,null,null,null,null,null,"5R","Fonds asiatique de développement (Manille)",""]
[null,null,null,null,null,null,null,"5S","Fonds spécial unifié de développement",""]
[null,null,null,null,null,null,null,"5T","BCIE",""]
[null,null,null,null,null,null,null,"5W","Banque des états de l'Afrique centrale",""]
[null,null,null,null,null,null,null,"5X","CEMAC",""]
[null,null,null,null,null,null,null,"5Y","ECCU",""]
[null,null,null,null,null,null,null,"5Z","Autres orga. bancaires et financiers non indiv.",""]
[null,null,null,null,null,null,null,"6B","OTAN",""]
[null,null,null,null,null,null,null,"6C","Conseil de l’Europe",""]
[null,null,null,null,null,null,null,"6D","CICR",""]
[null,null,null,null,null,null,null,"6E","ESA",""]
[null,null,null,null,null,null,null,"6F","Office Européenne des Brevets",""]
[null,null,null,null,null,null,null,"6G","EUROCONTROL",""]
[null,null,null,null,null,null,null,"6H","EUTELSAT",""]
[null,null,null,null,null,null,null,"6I","Union économique et monétaire ouest africaine",""]
[null,null,null,null,null,null,null,"6J","INTELSAT",""]
[null,null,null,null,null,null,null,"6K","UER",""]
[null,null,null,null,null,null,null,"6P","CERN",""]
[null,null,null,null,null,null,null,"6R","IDB",""]
[null,null,null,null,null,null,null,"6Z","Autres orga. ni bancaires ni financiers non indiv.",""]

{"sheet":"Impression","index":6,"n_rows":9,"n_cols":12,"rows_kept":9,"cut":false,"hidden":true,"merged":[[2,1,2,4],[3,1,3,4],[4,1,4,4]]}
["Caractéristiques du fichier : ",null,null,null,null,null,null,null,null,null,"Valeurs de contrôle du fichier : "]
[]
["Date / Heure",null,null,null,null,null,null,null,null,null,"Montant total"]
["ID Fichier",null,null,null,null,null,null,null,null,null,"Nombre d'ordres"]
["Date règlement"]
[]
["Liste des ordres de virement contenus dans le fichier : "]
[]
["Montant","Dv O","Dv R","Charge","Etablissement donneur d'ordre","Client donneur d'ordre","Bénéficiaire","Banque du bénéf.","Type","N° Compte du bénéficiaire","Motif de paiement","EndToEnd"]

{"sheet":"Table de conversion","index":7,"n_rows":256,"n_cols":16,"rows_kept":256,"cut":false,"hidden":true,"merged":[]}
["Code ASCII\nà la source","Valeur\nà la source","Code ASCII\ntransf.\nStandard","Code ASCII\ntransf.\nALPHANUM","Code ASCII\ntransf.\nALPHA","Code ASCII\ntransf.\nCar. Spec.","Code ASCII\ntransf.\nAdr. Mail","Valeur\ntransf.\nStandard","Valeur\ntransf.\nALPHANUM","Valeur\ntransf.\nALPHA","Valeur\ntransf.\nCar. Spec.","Valeur\ntransf.\nAdr. Mail",null,"abcdefghijklmnopqrstuvwxyzABCDEFGHIJKLMNOPQRSTUVWXYZ0123456789/-?:().,'+ ","!#&%*=^_`{|}~\";@[\\]","$<>"]
[1,{"$f":"CHAR(A2)","v":"\u0001"},null,null,null,null,null,{"$f":"IF(C2=\"\",\"\",CHAR(C2))","v":""},{"$f":"IF(D2=\"\",\"\",CHAR(D2))","v":""},{"$f":"IF(E2=\"\",\"\",CHAR(E2))","v":""},{"$f":"IF(F2=\"\",\"\",CHAR(F2))","v":""},{"$f":"IF(G2=\"\",\"\",CHAR(G2))","v":""}]
[2,"\u0002",null,null,null,null,null,"","","","",""]
[3,"\u0003",null,null,null,null,null,"","","","",""]
[4,"\u0004",null,null,null,null,null,"","","","",""]
[5,"\u0005",null,null,null,null,null,"","","","",""]
[6,"\u0006",null,null,null,null,null,"","","","",""]
[7,"\u0007",null,null,null,null,null,"","","","",""]
[8,"\b",null,null,null,null,null,"","","","",""]
[9,"\t",null,null,null,null,null,"","","","",""]
[10,"\n",null,null,null,null,null,"","","","",""]
[11,"\u000b",null,null,null,null,null,"","","","",""]
[12,"\f",null,null,null,null,null,"","","","",""]
[13,"\r",null,null,null,null,null,"","","","",""]
[14,"\u000e",null,null,null,null,null,"","","","",""]
[15,"\u000f",null,null,null,null,null,"","","","",""]
[16,"\u0010",null,null,null,null,null,"","","","",""]
[17,"\u0011",null,null,null,null,null,"","","","",""]
[18,"\u0012",null,null,null,null,null,"","","","",""]
[19,"\u0013",null,null,null,null,null,"","","","",""]
[20,"\u0014",null,null,null,null,null,"","","","",""]
[21,"\u0015",null,null,null,null,null,"","","","",""]
[22,"\u0016",null,null,null,null,null,"","","","",""]
[23,"\u0017",null,null,null,null,null,"","","","",""]
[24,"\u0018",null,null,null,null,null,"","","","",""]
[25,"\u0019",null,null,null,null,null,"","","","",""]
[26,"\u001a",null,null,null,null,null,"","","","",""]
[27,"\u001b",null,null,null,null,null,"","","","",""]
[28,"\u001c",null,null,null,null,null,"","","","",""]
[29,"\u001d",null,null,null,null,null,"","","","",""]
[30,"\u001e",null,null,null,null,null,"","","","",""]
[31,"\u001f",null,null,null,null,null,"","","","",""]
[32,{"$f":"CHAR(A33)","v":" "},32,null,null,32,32," ","",""," "," "]
[33,"!",null,null,null,33,33,"","","","!","!"]
[34,"\"",null,null,null,34,34,"","","","\"","\""]
[35,"#",null,null,null,35,35,"","","","#","#"]
[36,"$",null,null,null,null,36,"","","","","$"]
[37,"%",null,null,null,37,37,"","","","%","%"]
[38,"&",43,null,null,38,38,"+","","","&","&"]
[39,"'",39,null,null,39,39,"'","","",{"$f":"IF(F40=\"\",\"\",CHAR(F40))","v":"'"},"'"]
[40,"(",40,null,null,40,40,"(","","",{"$f":"IF(F41=\"\",\"\",CHAR(F41))","v":"("},"("]
[41,")",41,null,null,41,41,")","","",")",")"]
[42,"*",null,null,null,42,42,"","","","*","*"]
[43,"+",43,null,null,43,43,"+","","","+","+"]
[44,",",44,null,null,44,44,",","","",",",","]
[45,"-",45,null,null,45,45,"-","","","-","-"]
[46,".",46,null,null,46,46,".","","",".","."]
[47,"/",47,null,null,47,47,"/","","","/","/"]
[48,"0",48,48,null,48,48,"0","0","","0","0"]
[49,"1",49,49,null,49,49,"1","1","","1","1"]
[50,"2",50,50,null,50,50,"2","2","","2","2"]
[51,"3",51,51,null,51,51,"3","3","","3","3"]
[52,"4",52,52,null,52,52,"4","4","","4","4"]
[53,"5",53,53,null,53,53,"5","5","","5","5"]
[54,"6",54,54,null,54,54,"6","6","","6","6"]
[55,"7",55,55,null,55,55,"7","7","","7","7"]
[56,"8",56,56,null,56,56,"8","8","","8","8"]
[57,"9",57,57,null,57,57,"9","9","","9","9"]
[58,":",58,null,null,58,58,":","","",":",":"]
[59,";",null,null,null,59,59,"","","",";",";"]
[60,"<",null,null,null,null,60,"","","","","<"]
[61,"=",null,null,null,61,61,"","","","=","="]
[62,">",null,null,null,null,62,"","","","",">"]
[63,"?",63,null,null,63,63,"?","","","?","?"]
[64,"@",null,null,null,64,64,"","","","@","@"]
[65,"A",65,65,65,65,65,{"$f":"IF(C66=\"\",\"\",CHAR(C66))","v":"A"},{"$f":"IF(D66=\"\",\"\",CHAR(D66))","v":"A"},{"$f":"IF(E66=\"\",\"\",CHAR(E66))","v":"A"},"A",{"$f":"IF(G66=\"\",\"\",CHAR(G66))","v":"A"}]
[66,"B",66,66,66,66,66,"B","B","B","B","B"]
[67,"C",67,67,67,67,67,"C","C","C","C","C"]
[68,"D",68,68,68,68,68,"D","D","D","D","D"]
[69,"E",69,69,69,69,69,"E","E","E","E","E"]
[70,"F",70,70,70,70,70,"F","F","F","F","F"]
[71,"G",71,71,71,71,71,"G","G","G","G","G"]
[72,"H",72,72,72,72,72,"H","H","H","H","H"]
[73,"I",73,73,73,73,73,"I","I","I","I","I"]
[74,"J",74,74,74,74,74,"J","J","J","J","J"]
[75,"K",75,75,75,75,75,"K","K","K","K","K"]
[76,"L",76,76,76,76,76,"L","L","L","L","L"]
[77,"M",77,77,77,77,77,"M","M","M","M","M"]
[78,"N",78,78,78,78,78,"N","N","N","N","N"]
[79,"O",79,79,79,79,79,"O","O","O","O","O"]
[80,"P",80,80,80,80,80,"P","P","P","P","P"]
[81,"Q",81,81,81,81,81,"Q","Q","Q","Q","Q"]
[82,"R",82,82,82,82,82,"R","R","R","R","R"]
[83,"S",83,83,83,83,83,"S","S","S","S","S"]
[84,"T",84,84,84,84,84,"T","T","T","T","T"]
[85,"U",85,85,85,85,85,"U","U","U","U","U"]
[86,"V",86,86,86,86,86,"V","V","V","V","V"]
[87,"W",87,87,87,87,87,"W","W","W","W","W"]
[88,"X",88,88,88,88,88,"X","X","X","X","X"]
[89,"Y",89,89,89,89,89,"Y","Y","Y","Y","Y"]
[90,"Z",90,90,90,90,90,"Z","Z","Z","Z","Z"]
[91,"[",40,null,null,91,91,"(","","","[","["]
[92,"\\",null,null,null,92,92,"","","","\\","\\"]
[93,"]",41,null,null,93,93,")","","","]","]"]
[94,"^",null,null,null,94,94,"","","","^","^"]
[95,"_",null,null,null,95,95,"","","","_","_"]
[96,{"$f":"CHAR(A97)","v":"`"},39,null,null,96,96,"'","","","`","`"]
[97,"a",97,65,65,97,97,"a","A","A","a","a"]
[98,"b",98,66,66,98,98,"b","B","B","b","b"]
[99,"c",99,67,67,99,99,"c","C","C","c","c"]
[100,"d",100,68,68,100,100,"d","D","D","d","d"]
[101,"e",101,69,69,101,101,"e","E","E","e","e"]
[102,"f",102,70,70,102,102,"f","F","F","f","f"]
[103,"g",103,71,71,103,103,"g","G","G","g","g"]
[104,"h",104,72,72,104,104,"h","H","H",{"$f":"IF(F105=\"\",\"\",CHAR(F105))","v":"h"},"h"]
[105,"i",105,73,73,105,105,"i","I","I","i","i"]
[106,"j",106,74,74,106,106,"j","J","J","j","j"]
[107,"k",107,75,75,107,107,"k","K","K","k","k"]
[108,"l",108,76,76,108,108,"l","L","L","l","l"]
[109,"m",109,77,77,109,109,"m","M","M","m","m"]
[110,"n",110,78,78,110,110,"n","N","N","n","n"]
[111,"o",111,79,79,111,111,"o","O","O","o","o"]
[112,"p",112,80,80,112,112,"p","P","P","p","p"]
[113,"q",113,81,81,113,113,"q","Q","Q","q","q"]
[114,"r",114,82,82,114,114,"r","R","R","r","r"]
[115,"s",115,83,83,115,115,"s","S","S","s","s"]
[116,"t",116,84,84,116,116,"t","T","T","t","t"]
[117,"u",117,85,85,117,117,"u","U","U","u","u"]
[118,"v",118,86,86,118,118,"v","V","V","v","v"]
[119,"w",119,87,87,119,119,"w","W","W","w","w"]
[120,"x",120,88,88,120,120,"x","X","X","x","x"]
[121,"y",121,89,89,121,121,"y","Y","Y","y","y"]
[122,"z",122,90,90,122,122,"z","Z","Z","z","z"]
[123,"{",40,null,null,123,123,"(","","","{","{"]
[124,"|",null,null,null,124,124,"","","","|","|"]
[125,"}",41,null,null,125,125,")","","","}","}"]
[126,"~",null,null,null,126,126,"","","","~","~"]
[127,"\u007f",null,null,null,null,null,"","","","",""]
[128,"€",69,69,69,69,69,"E","E","E","E","E"]
[129,"\u0081",32,null,null,32,32,{"$f":"IF(C130=\"\",\"\",CHAR(C130))","v":" "},{"$f":"IF(D130=\"\",\"\",CHAR(D130))","v":""},{"$f":"IF(E130=\"\",\"\",CHAR(E130))","v":""}," ",{"$f":"IF(G130=\"\",\"\",CHAR(G130))","v":" "}]
[130,"‚",44,null,null,44,44,",","","",",",","]
[131,"ƒ",102,70,70,102,102,"f","F","F","f","f"]
[132,"„","44",null,null,"44","44",",","","",",",","]
[133,"…",null,null,null,null,null,"","","","",""]
[134,"†","43",null,null,"43","43","+","","","+","+"]
[135,"‡","43",null,null,"43","43","+","","","+","+"]
[136,"ˆ",null,null,null,94,94,"","","","^","^"]
[137,"‰",null,null,null,null,null,"","","","","",null,"‰"]
[138,"Š",83,83,83,83,83,"S","S","S","S","S"]
[139,"‹",40,null,null,40,60,"(","","","(","<"]
[140,"Œ",79,79,79,79,79,"O","O","O","O","O"]
[141,"\u008d",32,null,null,32,32," ","",""," "," "]
[142,"Ž",90,90,90,90,90,"Z","Z","Z","Z","Z"]
[143,"\u008f",32,null,null,32,32," ","",""," "," "]
[144,"\u0090",32,null,null,32,32," ","",""," "," "]
[145,"‘",39,null,null,39,39,"'","","","'","'"]
[146,"’",39,null,null,39,39,"'","","","'","'"]
[147,"“",39,null,null,34,34,"'","","","\"","\""]
[148,"”",39,null,null,34,34,"'","","","\"","\""]
[149,"•",null,null,null,null,null,"","","","",""]
[150,"–","45",null,null,"45","45","-","","","-","-"]
[151,"—","45",null,null,"45","45","-","","","-","-"]
[152,"˜",45,null,null,126,126,"-","","","~","~"]
[153,"™",63,null,null,63,63,"?","","","?","?"]
[154,"š",115,83,83,115,115,"s","S","S","s","s"]
[155,"›",41,null,null,41,62,")","","",")",">"]
[156,"œ",111,79,79,111,111,"o","O","O","o","o"]
[157,"\u009d",32,null,null,32,32," ","",""," "," "]
[158,"ž",122,90,90,122,122,"z","Z","Z","z","z"]
[159,"Ÿ",89,89,89,89,89,"Y","Y","Y","Y","Y"]
[160,{"$f":"CHAR(A161)","v":" "},32,null,null,32,32," ","",""," "," "]
[161,"¡",null,null,null,null,null,"","","","",""]
[162,"¢",99,67,67,99,99,"c","C","C","c","c"]
[163,"£",76,76,76,76,76,"L","L","L","L","L"]
[164,"¤","111",79,79,"111","111","o","O","O","o","o"]
[165,"¥",89,89,89,89,89,"Y","Y","Y","Y","Y"]
[166,"¦","73","73","73",124,124,"I","I","I","|","|"]
[167,"§",null,null,null,null,null,"","","","",""]
[168,"¨",null,null,null,null,null,"","","",{"$f":"IF(F169=\"\",\"\",CHAR(F169))","v":""},""]
[169,"©","67","67","67","67","67","C","C","C","C","C"]
[170,"ª","97",65,65,"97","97","a","A","A","a","a"]
[171,"«",39,null,null,34,34,"'","","","\"","\""]
[172,"¬",null,null,null,null,null,"","","","",""]
[173,"­","45",null,null,"45","45","-","","","-","-"]
[174,"®","82","82","82","82","82","R","R","R","R","R"]
[175,"¯","45",null,null,"45","45","-","","","-","-"]
[176,"°","111",79,79,"111","111","o","O","O","o","o"]
[177,"±",null,null,null,null,null,"","","","",""]
[178,"²","50","50",null,"50","50","2","2","","2","2"]
[179,"³","51","51",null,"51","51","3","3","","3","3"]
[180,"´",39,null,null,39,39,"'","","","'","'"]
[181,"µ",117,85,85,117,117,"u","U","U","u","u"]
[182,"¶",null,null,null,null,null,"","","","",""]
[183,"·",null,null,null,null,null,"","","","",""]
[184,"¸","44",null,null,"44","44",",","","",",",","]
[185,"¹","49","49",null,"49","49","1","1","","1","1"]
[186,"º","48","48",null,"48","48","0","0","","0","0"]
[187,"»",39,null,null,34,34,"'","","","\"","\""]
[188,"¼",null,null,null,null,null,"","","","",""]
[189,"½",null,null,null,null,null,"","","","",""]
[190,"¾",null,null,null,null,null,"","","","",""]
[191,"¿","63",null,null,"63","63","?","","","?","?"]
[192,"À",65,65,65,65,65,"A","A","A","A","A"]
[193,"Á",65,65,65,65,65,{"$f":"IF(C194=\"\",\"\",CHAR(C194))","v":"A"},{"$f":"IF(D194=\"\",\"\",CHAR(D194))","v":"A"},{"$f":"IF(E194=\"\",\"\",CHAR(E194))","v":"A"},"A",{"$f":"IF(G194=\"\",\"\",CHAR(G194))","v":"A"}]
[194,"Â",65,65,65,65,65,"A","A","A","A","A"]
[195,"Ã",65,65,65,65,65,"A","A","A","A","A"]
[196,"Ä",65,65,65,65,65,"A","A","A","A","A"]
[197,"Å",65,65,65,65,65,"A","A","A","A","A"]
[198,"Æ",65,65,65,65,65,"A","A","A","A","A"]
[199,"Ç",67,67,67,67,67,"C","C","C","C","C"]
[200,"È",69,69,69,69,69,"E","E","E","E","E"]
[201,"É",69,69,69,69,69,"E","E","E","E","E"]
[202,"Ê",69,69,69,69,69,"E","E","E","E","E"]
[203,"Ë",69,69,69,69,69,"E","E","E","E","E"]
[204,"Ì",73,73,73,73,73,"I","I","I","I","I"]
[205,"Í",73,73,73,73,73,"I","I","I","I","I"]
[206,"Î",73,73,73,73,73,"I","I","I","I","I"]
[207,"Ï",73,73,73,73,73,"I","I","I","I","I"]
[208,"Ð",68,68,68,68,68,"D","D","D","D","D"]
[209,"Ñ",78,78,78,78,78,"N","N","N","N","N"]
[210,"Ò",79,79,79,79,79,"O","O","O","O","O"]
[211,"Ó",79,79,79,79,79,"O","O","O","O","O"]
[212,"Ô",79,79,79,79,79,"O","O","O","O","O"]
[213,"Õ",79,79,79,79,79,"O","O","O","O","O"]
[214,"Ö",79,79,79,79,79,"O","O","O","O","O"]
[215,"×",120,88,88,120,120,"x","X","X","x","x"]
[216,"Ø",79,79,79,79,79,"O","O","O","O","O"]
[217,"Ù",85,85,85,85,85,"U","U","U","U","U"]
[218,"Ú",85,85,85,85,85,"U","U","U","U","U"]
[219,"Û",85,85,85,85,85,"U","U","U","U","U"]
[220,"Ü",85,85,85,85,85,"U","U","U","U","U"]
[221,"Ý",89,89,89,89,89,"Y","Y","Y","Y","Y"]
[222,"Þ","68","68","68","68","68","D","D","D","D","D"]
[223,"ß","66","66","66","66","66","B","B","B","B","B"]
[224,{"$f":"CHAR(A225)","v":"à"},97,65,65,97,97,"a","A","A","a","a"]
[225,"á",97,65,65,97,97,"a","A","A","a","a"]
[226,"â",97,65,65,97,97,"a","A","A","a","a"]
[227,"ã",97,65,65,97,97,"a","A","A","a","a"]
[228,"ä",97,65,65,97,97,"a","A","A","a","a"]
[229,"å",97,65,65,97,97,"a","A","A","a","a"]
[230,"æ",97,65,65,97,97,"a","A","A","a","a"]
[231,"ç",99,67,67,99,99,"c","C","C","c","c"]
[232,"è",101,69,69,101,101,"e","E","E",{"$f":"IF(F233=\"\",\"\",CHAR(F233))","v":"e"},"e"]
[233,"é",101,69,69,101,101,"e","E","E","e","e"]
[234,"ê",101,69,69,101,101,"e","E","E","e","e"]
[235,"ë",101,69,69,101,101,"e","E","E","e","e"]
[236,"ì",105,73,73,105,105,"i","I","I","i","i"]
[237,"í",105,73,73,105,105,"i","I","I","i","i"]
[238,"î",105,73,73,105,105,"i","I","I","i","i"]
[239,"ï",105,73,73,105,105,"i","I","I","i","i"]
[240,"ð","111",79,79,"111","111","o","O","O","o","o"]
[241,"ñ",110,78,78,110,110,"n","N","N","n","n"]
[242,"ò",111,79,79,111,111,"o","O","O","o","o"]
[243,"ó",111,79,79,111,111,"o","O","O","o","o"]
[244,"ô",111,79,79,111,111,"o","O","O","o","o"]
[245,"õ",111,79,79,111,111,"o","O","O","o","o"]
[246,"ö",111,79,79,111,111,"o","O","O","o","o"]
[247,"÷",47,null,null,47,47,"/","","","/","/"]
[248,"ø",111,79,79,111,111,"o","O","O","o","o"]
[249,"ù",117,85,85,117,117,"u","U","U","u","u"]
[250,"ú",117,85,85,117,117,"u","U","U","u","u"]
[251,"û",117,85,85,117,117,"u","U","U","u","u"]
[252,"ü",117,85,85,117,117,"u","U","U","u","u"]
[253,"ý",121,89,89,121,121,"y","Y","Y","y","y"]
[254,"þ","112",80,80,"112","112","p","P","P","p","p"]
[255,"ÿ",121,89,89,121,121,"y","Y","Y","y","y"]